clear-v
type: LexicalEntry
canonical form: clear
sense: 02294039-v
part of speech: verb

02294039-v
type: LexicalConcept
in scheme: en-word.net
definition: be debited and credited to the proper bank accounts
example: The payment should clear within 2 business days
ili: i33177
lexfile: verb.possession
part of speech: verb
hypernym: 02372362-v