stable-a
type: LexicalEntry
canonical form: stable
sense: 02281838-s
part of speech: adjective

02281838-s
type: LexicalConcept
in scheme: en-word.net
definition: firm and dependable; subject to little fluctuation
example: the economy is stable
ili: i12582
lexfile: adj.all
part of speech: adjective satellite
similar: https://en-word.net/synset/02281076-a