foreclose-v
type: LexicalEntry
canonical form: foreclose
sense: 02281413-v
part of speech: verb

02281413-v
type: LexicalConcept
in scheme: en-word.net
definition: subject to foreclosing procedures; take away the right of mortgagors to redeem their mortgage
ili: i33116
lexfile: verb.possession
part of speech: verb
hypernym: 02281167-v