pretend-v
type: LexicalEntry
canonical form: pretend
sense: 02280644-v
part of speech: verb

02280644-v
type: LexicalConcept
in scheme: en-word.net
definition: put forward a claim and assert right or possession of
example: pretend the title of King
ili: i33111
lexfile: verb.possession
part of speech: verb
hypernym: 02280210-v