ringlet-n
type: LexicalEntry
canonical form: ringlet
sense: 02280394-n
part of speech: noun

ringlet butterfly-n
type: LexicalEntry
canonical form: ringlet butterfly
sense: 02280394-n
part of speech: noun

02280394-n
type: LexicalConcept
in scheme: en-word.net
definition: any of various butterflies belonging to the family Satyridae
ili: i47502
lexfile: noun.animal
part of speech: noun
hypernym: 02276911-n