raid-v
type: LexicalEntry
canonical form: raid
sense: 02279997-v
part of speech: verb

02279997-v
type: LexicalConcept
in scheme: en-word.net
definition: take over (a company) by buying a controlling interest of its stock
example: T. Boone Pickens raided many large companies
ili: i33109
lexfile: verb.possession
part of speech: verb
hypernym: 02279327-v