misspend-v
type: LexicalEntry
canonical form: misspend
sense: 02271522-v
part of speech: verb

02271522-v
type: LexicalConcept
in scheme: en-word.net
definition: spend (money or other resources) unwisely
ili: i33069
lexfile: verb.possession
part of speech: verb
hypernym: 02271905-v