watery-a
type: LexicalEntry
canonical form: watery
sense: 02270121-s
part of speech: adjective

02270121-s
type: LexicalConcept
in scheme: en-word.net
definition: relating to or resembling or consisting of water
example: a watery substance
example: a watery color
ili: i12522
lexfile: adj.all
part of speech: adjective satellite
similar: https://en-word.net/synset/02269142-a