award-v
type: LexicalEntry
canonical form: award
sense: 02267085-v
part of speech: verb

grant-v
type: LexicalEntry
canonical form: grant
sense: 02267085-v
part of speech: verb

02267085-v
type: LexicalConcept
in scheme: en-word.net
definition: give as judged due or on the basis of merit
example: the referee awarded a free kick to the team
example: the jury awarded a million dollars to the plaintiff
example: Funds are granted to qualified researchers
ili: i33044
lexfile: verb.possession
part of speech: verb
hypernym: 02321848-v