leafhopper-n
type: LexicalEntry
canonical form: leafhopper
sense: 02261864-n
part of speech: noun

02261864-n
type: LexicalConcept
in scheme: en-word.net
definition: small leaping insect that sucks the juices of plants
ili: i47398
lexfile: noun.animal
part of speech: noun
hypernym: 02248663-n