liquidate-v
type: LexicalEntry
canonical form: liquidate
sense: 02259303-v
part of speech: verb

02259303-v
type: LexicalConcept
in scheme: en-word.net
definition: settle the affairs of by determining the debts and applying the assets to pay them off
example: liquidate a company
ili: i33007
lexfile: verb.possession
part of speech: verb
hypernym: 02259066-v