pay-v
type: LexicalEntry
canonical form: pay
sense: 02256551-v
part of speech: verb

02256551-v
type: LexicalConcept
in scheme: en-word.net
definition: give money, usually in exchange for goods or services
example: I paid four dollars for this sandwich
example: Pay the waitress, please
ili: i32996
lexfile: verb.possession
part of speech: verb
hypernym: 02204104-v