recoup-v
type: LexicalEntry
canonical form: recoup
sense: 02254399-v
part of speech: verb

reimburse-v
type: LexicalEntry
canonical form: reimburse
sense: 02254399-v
part of speech: verb

02254399-v
type: LexicalConcept
in scheme: en-word.net
definition: reimburse or compensate (someone), as for a loss
ili: i32985
lexfile: verb.possession
part of speech: verb
hypernym: 02254549-v