realize-v
type: LexicalEntry
canonical form: realize
sense: 02249385-v
part of speech: verb

realise-v
type: LexicalEntry
canonical form: realise
sense: 02249385-v
part of speech: verb

02249385-v
type: LexicalConcept
in scheme: en-word.net
definition: convert into cash; of goods and property
ili: i32961
lexfile: verb.possession
part of speech: verb
domain topic: 01092370-n
hypernym: 02247246-v