source-v
type: LexicalEntry
canonical form: source
sense: 02243318-v
part of speech: verb

02243318-v
type: LexicalConcept
in scheme: en-word.net
definition: get (a product) from another country or business
example: She sourced a supply of carpet
example: They are sourcing from smaller companies
ili: i32932
lexfile: verb.possession
part of speech: verb
hypernym: 02242867-v