deny-v
type: LexicalEntry
canonical form: deny
sense: 02217856-v
part of speech: verb

abnegate-v
type: LexicalEntry
canonical form: abnegate
sense: 02217856-v
part of speech: verb

02217856-v
type: LexicalConcept
in scheme: en-word.net
definition: deny oneself (something); restrain, especially from indulging in some pleasure
example: She denied herself wine and spirits
ili: i32810
lexfile: verb.possession
part of speech: verb
hypernym: 02516039-v
similar: 02217607-v