flush-v
type: LexicalEntry
canonical form: flush
sense: 02203949-v
part of speech: verb

02203949-v
type: LexicalConcept
in scheme: en-word.net
definition: glow or cause to glow with warm color or light
example: the sky flushed with rosy splendor
ili: i32754
lexfile: verb.perception
part of speech: verb
hypernym: 02165374-v