incline-v
type: LexicalEntry
canonical form: incline
sense: 02175766-v
part of speech: verb

02175766-v
type: LexicalConcept
in scheme: en-word.net
definition: bend or turn (one's ear) towards a speaker in order to listen well
example: He inclined his ear to the wise old man
ili: i32610
lexfile: verb.perception
part of speech: verb
hypernym: 02175483-v