gloat-v
type: LexicalEntry
canonical form: gloat
sense: 02171305-v
part of speech: verb

02171305-v
type: LexicalConcept
in scheme: en-word.net
definition: gaze at or think about something with great self-satisfaction, gratification, or joy
ili: i32588
lexfile: verb.perception
part of speech: verb
hypernym: 02134989-v