beetle-n
type: LexicalEntry
canonical form: beetle
sense: 02167116-n
part of speech: noun

02167116-n
type: LexicalConcept
in scheme: en-word.net
definition: insect having biting mouthparts and front wings modified to form horny covers overlying the membranous rear wings
ili: i46842
lexfile: noun.animal
part of speech: noun
hypernym: 02162607-n