radiate-v
type: LexicalEntry
canonical form: radiate
sense: 02164982-v
part of speech: verb

02164982-v
type: LexicalConcept
in scheme: en-word.net
definition: cause to be seen by emitting light as if in rays
example: The sun is radiating
ili: i32553
lexfile: verb.perception
part of speech: verb
hypernym: 02128368-v