develop-v
type: LexicalEntry
canonical form: develop
sense: 02143239-v
part of speech: verb

02143239-v
type: LexicalConcept
in scheme: en-word.net
definition: make visible by means of chemical solutions
example: Please develop this roll of film for me
ili: i32448
lexfile: verb.perception
part of speech: verb
domain topic: 13557997-n
domain topic: 00905257-n
hypernym: 00126072-v