reverberate-v
type: LexicalEntry
canonical form: reverberate
sense: 02140998-v
part of speech: verb

02140998-v
type: LexicalConcept
in scheme: en-word.net
definition: be reflected as heat, sound, or light or shock waves
example: the waves reverberate as far away as the end of the building
ili: i32436
lexfile: verb.perception
part of speech: verb
hypernym: 02140736-v
similar: 02140736-v