discover-v
type: LexicalEntry
canonical form: discover
sense: 02132531-v
part of speech: verb

02132531-v
type: LexicalConcept
in scheme: en-word.net
definition: see for the first time; make a discovery
example: Who discovered the North Pole?
ili: i32397
lexfile: verb.perception
part of speech: verb
entails: 02110960-v
hypernym: 02110960-v