nettle-v
type: LexicalEntry
canonical form: nettle
sense: 02125180-v
part of speech: verb

urticate-v
type: LexicalEntry
canonical form: urticate
sense: 02125180-v
part of speech: verb

02125180-v
type: LexicalConcept
in scheme: en-word.net
definition: sting with or as with nettles and cause a stinging pain or sensation
ili: i32359
lexfile: verb.perception
part of speech: verb
hypernym: 02124916-v
similar: 02125377-v