apart-a
type: LexicalEntry
canonical form: apart
sense: 02117441-s
part of speech: adjective

02117441-s
type: LexicalConcept
in scheme: en-word.net
definition: having characteristics not shared by others
example: scientists felt they were a group apart
  source: Vannever Bush
ili: i11563
lexfile: adj.all
part of speech: adjective satellite
similar: https://en-word.net/synset/02116958-a