close-v
type: LexicalEntry
canonical form: close
sense: 02108781-v
part of speech: verb

02108781-v
type: LexicalConcept
in scheme: en-word.net
definition: change one's body stance so that the forward shoulder and foot are closer to the intended point of impact
ili: i32286
lexfile: verb.motion
part of speech: verb
domain topic: 00472512-n
hypernym: 01835473-v