plow-v
type: LexicalEntry
canonical form: plow
sense: 02101131-v
part of speech: verb

plough-v
type: LexicalEntry
canonical form: plough
sense: 02101131-v
part of speech: verb

02101131-v
type: LexicalConcept
in scheme: en-word.net
definition: move in a way resembling that of a plow cutting into or going through the soil
example: The ship plowed through the water
ili: i32241
lexfile: verb.motion
part of speech: verb
hypernym: 01839438-v