dodge-v
type: LexicalEntry
canonical form: dodge
sense: 02100772-v
part of speech: verb

02100772-v
type: LexicalConcept
in scheme: en-word.net
definition: make a sudden movement in a new direction so as to avoid
example: The child dodged the teacher's blow
ili: i32239
lexfile: verb.motion
part of speech: verb
hypernym: 01835473-v