turn-v
type: LexicalEntry
canonical form: turn
sense: 02094702-v
part of speech: verb

02094702-v
type: LexicalConcept
in scheme: en-word.net
definition: cause to move along an axis or into a new direction
example: turn your face to the wall
example: turn the car around
example: turn your dance partner around
ili: i32204
lexfile: verb.motion
part of speech: verb
hypernym: 01854282-v
similar: 02094251-v