crash-v
type: LexicalEntry
canonical form: crash
sense: 02092894-v
part of speech: verb

02092894-v
type: LexicalConcept
in scheme: en-word.net
definition: move with, or as if with, a crashing noise
example: The car crashed through the glass door
ili: i32194
lexfile: verb.motion
part of speech: verb
hypernym: 01835473-v