scientific-a
type: LexicalEntry
canonical form: scientific
sense: https://en-word.net/lemma/scientific-a#02091950-a
part of speech: adjective

https://en-word.net/synset/02091950-a
type: LexicalConcept
in scheme: en-word.net
definition: conforming with the principles or methods used in science
example: a scientific approach
ili: i11423
lexfile: adj.all
part of speech: adjective
attribute: 06008718-n
similar: 02092125-s