seep-v
type: LexicalEntry
canonical form: seep
sense: 02075902-v
part of speech: verb

ooze-v
type: LexicalEntry
canonical form: ooze
sense: 02075902-v
part of speech: verb

02075902-v
type: LexicalConcept
in scheme: en-word.net
definition: pass gradually or leak through or as if through small openings
ili: i32107
lexfile: verb.motion
part of speech: verb
hypernym: 02070867-v