cascade-v
type: LexicalEntry
canonical form: cascade
sense: 02075244-v
part of speech: verb

cascade down-v
type: LexicalEntry
canonical form: cascade down
sense: 02075244-v
part of speech: verb

02075244-v
type: LexicalConcept
in scheme: en-word.net
definition: rush down in big quantities, like a cascade
ili: i32103
lexfile: verb.motion
part of speech: verb
hypernym: 01974840-v