flow-v
type: LexicalEntry
canonical form: flow
sense: 02070438-v
part of speech: verb

flux-v
type: LexicalEntry
canonical form: flux
sense: 02070438-v
part of speech: verb

02070438-v
type: LexicalConcept
in scheme: en-word.net
definition: move or progress freely as if in a stream
example: The crowd flowed out of the stadium
ili: i32078
lexfile: verb.motion
part of speech: verb
hypernym: 01835473-v