deviate-v
type: LexicalEntry
canonical form: deviate
sense: 02069013-v
part of speech: verb

02069013-v
type: LexicalConcept
in scheme: en-word.net
definition: cause to turn away from a previous or expected course
example: The river was deviated to prevent flooding
ili: i32071
lexfile: verb.motion
part of speech: verb
hypernym: 01956222-v