commute-v
type: LexicalEntry
canonical form: commute
sense: 02065774-v
part of speech: verb

02065774-v
type: LexicalConcept
in scheme: en-word.net
definition: travel back and forth regularly, as between one's place of work and home
ili: i32054
lexfile: verb.motion
part of speech: verb
hypernym: 01846997-v