shrink back-v
type: LexicalEntry
canonical form: shrink back
sense: 02065294-v
part of speech: verb

retract-v
type: LexicalEntry
canonical form: retract
sense: 02065294-v
part of speech: verb

02065294-v
type: LexicalConcept
in scheme: en-word.net
definition: pull away from a source of disgust or fear
ili: i32052
lexfile: verb.motion
part of speech: verb
hypernym: 02064997-v