hardy-a
type: LexicalEntry
canonical form: hardy
sense: 02046711-s
part of speech: adjective

02046711-s
type: LexicalConcept
in scheme: en-word.net
definition: able to survive under unfavorable weather conditions
example: strawberries are hardy and easy to grow
example: camels are tough and hardy creatures
ili: i11171
lexfile: adj.all
part of speech: adjective satellite
similar: https://en-word.net/synset/02045115-a