curtsy-v
type: LexicalEntry
canonical form: curtsy
sense: 02044394-v
part of speech: verb

curtsey-v
type: LexicalEntry
canonical form: curtsey
sense: 02044394-v
part of speech: verb

02044394-v
type: LexicalConcept
in scheme: en-word.net
definition: bend the knees in a gesture of respectful greeting
ili: i31945
lexfile: verb.motion
part of speech: verb
hypernym: 02044118-v