bow-v-1
type: LexicalEntry
canonical form: bow
sense: 02044118-v
part of speech: verb

02044118-v
type: LexicalConcept
in scheme: en-word.net
definition: bend the head or the upper part of the body in a gesture of respect or greeting
example: He bowed before the King
ili: i31944
lexfile: verb.motion
part of speech: verb
hypernym: 01987785-v