liberal-a
type: LexicalEntry
canonical form: liberal
sense: 02038880-s
part of speech: adjective

02038880-s
type: LexicalConcept
in scheme: en-word.net
definition: having political or social views favoring reform and progress
ili: i11133
lexfile: adj.all
part of speech: adjective satellite
similar: https://en-word.net/synset/02038342-a