sally forth-v
type: LexicalEntry
canonical form: sally forth
sense: 02018883-v
part of speech: verb

sally out-v
type: LexicalEntry
canonical form: sally out
sense: 02018883-v
part of speech: verb

02018883-v
type: LexicalConcept
in scheme: en-word.net
definition: set out in a sudden, energetic or violent manner
ili: i31813
lexfile: verb.motion
part of speech: verb
hypernym: 02018017-v