force out-v
type: LexicalEntry
canonical form: force out
sense: 02017692-v
part of speech: verb

crowd out-v
type: LexicalEntry
canonical form: crowd out
sense: 02017692-v
part of speech: verb

02017692-v
type: LexicalConcept
in scheme: en-word.net
definition: press, force, or thrust out of a small space
example: The weeds crowded out the flowers
ili: i31807
lexfile: verb.motion
part of speech: verb
hypernym: 02017423-v