break-v
type: LexicalEntry
canonical form: break
sense: 01995361-v
part of speech: verb

01995361-v
type: LexicalConcept
in scheme: en-word.net
definition: emerge from the surface of a body of water
example: The whales broke
ili: i31695
lexfile: verb.motion
part of speech: verb
hypernym: 00423043-v