subside-v
type: LexicalEntry
canonical form: subside
sense: 01990381-v
part of speech: verb

01990381-v
type: LexicalConcept
in scheme: en-word.net
definition: sink to a lower level or form a depression
example: the valleys subside
ili: i31668
lexfile: verb.motion
part of speech: verb
hypernym: 02043524-v