right-v
type: LexicalEntry
canonical form: right
sense: 01988748-v
part of speech: verb

01988748-v
type: LexicalConcept
in scheme: en-word.net
definition: put in or restore to an upright position
example: They righted the sailboat that had capsized
ili: i31659
lexfile: verb.motion
part of speech: verb
hypernym: 00126072-v
similar: 01988588-v