moot-a
type: LexicalEntry
canonical form: moot
sense: 01984089-s
part of speech: adjective

01984089-s
type: LexicalConcept
in scheme: en-word.net
definition: of no legal significance (as having been previously decided)
ili: i10833
lexfile: adj.all
part of speech: adjective satellite
domain topic: 08458195-n
similar: https://en-word.net/synset/01983148-a