weak-a
type: LexicalEntry
canonical form: weak
sense: 01967242-s
part of speech: adjective

01967242-s
type: LexicalConcept
in scheme: en-word.net
definition: (used of verbs) having standard (or regular) inflection
ili: i10735
lexfile: adj.all
part of speech: adjective satellite
domain topic: 06184139-n
similar: https://en-word.net/synset/01966104-a