activated-a
type: LexicalEntry
canonical form: activated
sense: 01960827-s
part of speech: adjective

01960827-s
type: LexicalConcept
in scheme: en-word.net
definition: (of sewage) treated with aeration and bacteria to aid decomposition
ili: i10693
lexfile: adj.all
part of speech: adjective satellite
similar: https://en-word.net/synset/01960457-a